Reaction Details
TargetTyrosine-protein kinase Mer
LigandBDBM50384592
Substrate/Competitorn/a
Meas. Tech.ChEMBL_820659 (CHEMBL2037930)
IC50 56±n/a nM
Citation Liu, JYang, CSimpson, CDeryckere, DVan Deusen, AMiley, MJKireev, DNorris-Drouin, JSather, SHunter, DKorboukh, VKPatel, HSJanzen, WPMachius, MJohnson, GLEarp, HSGraham, DKFrye, SVWang, X Discovery of Novel Small Molecule Mer Kinase Inhibitors for the Treatment of Pediatric Acute Lymphoblastic Leukemia. ACS Med Chem Lett3:129-134 (2012) 
 
Tyrosine-protein kinase Mer
Name:Tyrosine-protein kinase Mer
Type:PROTEIN
Mol. Mass.:110234.77
Organism:Homo sapiens (Human)
Description:ChEMBL_1498723
Residue:999
BDBM50384592
NameBDBM50384592
Synonyms:CHEMBL2036628
TypeSmall organic molecule
Emp. Form.C19H24N6
Mol. Mass.336.4341
SMILESCNc1ncc2c(nn(C[C@H]3CC[C@H](N)CC3)c2n1)-c1ccccc1