Reaction Details
TargetG-protein coupled receptor 35
LigandBDBM4078
Substrate/Competitorn/a
Meas. Tech.ChEMBL_821049 (CHEMBL2039375)
IC50 100±n/a nM
Citation Deng, HHu, HLing, SFerrie, AMFang, Y Discovery of Natural Phenols as G Protein-Coupled Receptor-35 (GPR35) Agonists. ACS Med Chem Lett3:165-169 (2012) 
 
G-protein coupled receptor 35
Name:G-protein coupled receptor 35
Type:Enzyme Catalytic Domain
Mol. Mass.:34085.57
Organism:Homo sapiens (Human)
Description:gi_33695097
Residue:309
BDBM4078
NameBDBM4078
Synonyms:6,7,13,14-tetrahydroxy-2,9-dioxatetracyclo[6.6.2.0^{4,16}.0^{11,15}]hexadeca-1(14),4(16),5,7,11(15),12-hexaene-3,10-dione ELLAGIC ACID Ellagic acid (18) MLS000069632 cid_5281855
TypeSmall organic molecule
Emp. Form.C14H6O8
Mol. Mass.302.1926
SMILESOc1cc2c3c(oc(=O)c4cc(O)c(O)c(oc2=O)c34)c1O