Reaction Details
TargetAcetylcholinesterase
LigandBDBM50384797
Substrate/Competitorn/a
Meas. Tech.ChEMBL_821065 (CHEMBL2039391)
IC50 9300±n/a nM
Citation Silva, DChioua, MSamadi, ACarmo Carreiras, MJimeno, MLMendes, ERíos, Cde LRomero, AVillarroya, MLópez, MGMarco-Contelles, J Synthesis and pharmacological assessment of diversely substituted pyrazolo[3,4-b]quinoline, and benzo[b]pyrazolo[4,3-g][1,8]naphthyridine derivatives. Eur J Med Chem46:4676-81 (2011) 
 
Acetylcholinesterase
Name:Acetylcholinesterase
Type:Enzyme
Mol. Mass.:71812.79
Organism:Electrophorus electricus (Electric eel)
Description:n/a
Residue:633
BDBM50384797
NameBDBM50384797
Synonyms:CHEMBL2037383
TypeSmall organic molecule
Emp. Form.C24H31N5O2
Mol. Mass.421.5352
SMILESCn1nc(C(N)=O)c2c(NCCCCCCOc3ccccc3)c3CCCCc3nc12