Reaction Details
TargetAcetylcholinesterase
LigandBDBM50384792
Substrate/Competitorn/a
Meas. Tech.ChEMBL_821065 (CHEMBL2039391)
IC50 230±n/a nM
Citation Silva, DChioua, MSamadi, ACarmo Carreiras, MJimeno, MLMendes, ERíos, Cde LRomero, AVillarroya, MLópez, MGMarco-Contelles, J Synthesis and pharmacological assessment of diversely substituted pyrazolo[3,4-b]quinoline, and benzo[b]pyrazolo[4,3-g][1,8]naphthyridine derivatives. Eur J Med Chem46:4676-81 (2011) 
 
Acetylcholinesterase
Name:Acetylcholinesterase
Type:Enzyme
Mol. Mass.:71812.79
Organism:Electrophorus electricus (Electric eel)
Description:n/a
Residue:633
BDBM50384792
NameBDBM50384792
Synonyms:CHEMBL2037385
TypeSmall organic molecule
Emp. Form.C22H22N6O
Mol. Mass.386.4497
SMILESCC(=O)Nc1nn(C)c2nc3nc4CCCCc4c(N)c3c(-c3ccccc3)c12