Reaction Details
TargetArachidonate 5-lipoxygenase-activating protein
LigandBDBM50385357
Substrate/Competitorn/a
Meas. Tech.ChEMBL_822749 (CHEMBL2040233)
IC50 250±n/a nM
Citation Banoglu, EÇaliskan, BLuderer, SEren, GÖzkan, YAltenhofen, WWeinigel, CBarz, DGerstmeier, JPergola, CWerz, O Identification of novel benzimidazole derivatives as inhibitors of leukotriene biosynthesis by virtual screening targeting 5-lipoxygenase-activating protein (FLAP). Bioorg Med Chem20:3728-41 (2012) 
 
Arachidonate 5-lipoxygenase-activating protein
Name:Arachidonate 5-lipoxygenase-activating protein
Type:Enzyme
Mol. Mass.:18159.90
Organism:Homo sapiens (Human)
Description:P20292
Residue:161
BDBM50385357
NameBDBM50385357
Synonyms:CHEMBL2036182
TypeSmall organic molecule
Emp. Form.C27H27F3N2
Mol. Mass.436.5119
SMILESCC(C)Cc1ccc(cc1)C(C)c1nc2ccccc2n1Cc1ccccc1C(F)(F)F