Reaction Details
TargetArachidonate 5-lipoxygenase-activating protein
LigandBDBM50385359
Substrate/Competitorn/a
Meas. Tech.ChEMBL_822749 (CHEMBL2040233)
IC50 500±n/a nM
Citation Banoglu, EÇaliskan, BLuderer, SEren, GÖzkan, YAltenhofen, WWeinigel, CBarz, DGerstmeier, JPergola, CWerz, O Identification of novel benzimidazole derivatives as inhibitors of leukotriene biosynthesis by virtual screening targeting 5-lipoxygenase-activating protein (FLAP). Bioorg Med Chem20:3728-41 (2012) 
 
Arachidonate 5-lipoxygenase-activating protein
Name:Arachidonate 5-lipoxygenase-activating protein
Type:Enzyme
Mol. Mass.:18159.90
Organism:Homo sapiens (Human)
Description:P20292
Residue:161
BDBM50385359
NameBDBM50385359
Synonyms:CHEMBL2036186
TypeSmall organic molecule
Emp. Form.C26H26Cl2N2
Mol. Mass.437.404
SMILESCC(C)Cc1ccc(cc1)C(C)c1nc2ccccc2n1Cc1ccc(Cl)cc1Cl