Reaction Details
TargetArachidonate 5-lipoxygenase-activating protein
LigandBDBM50385377
Substrate/Competitorn/a
Meas. Tech.ChEMBL_822749 (CHEMBL2040233)
IC50 190±n/a nM
Citation Banoglu, EÇaliskan, BLuderer, SEren, GÖzkan, YAltenhofen, WWeinigel, CBarz, DGerstmeier, JPergola, CWerz, O Identification of novel benzimidazole derivatives as inhibitors of leukotriene biosynthesis by virtual screening targeting 5-lipoxygenase-activating protein (FLAP). Bioorg Med Chem20:3728-41 (2012) 
 
Arachidonate 5-lipoxygenase-activating protein
Name:Arachidonate 5-lipoxygenase-activating protein
Type:Enzyme
Mol. Mass.:18159.90
Organism:Homo sapiens (Human)
Description:P20292
Residue:161
BDBM50385377
NameBDBM50385377
Synonyms:CHEMBL2036378
TypeSmall organic molecule
Emp. Form.C26H27ClN2O
Mol. Mass.418.958
SMILESCC(C)Cc1ccc(cc1)C(C)c1nc2cc(O)ccc2n1Cc1ccccc1Cl