Reaction Details
TargetTransient receptor potential cation channel subfamily V member 1
LigandBDBM20321
Substrate/Competitorn/a
Meas. Tech.ChEMBL_826070 (CHEMBL2045501)
Ki 53.5±n/a nM
Citation Kim, YSKil, MJKang, SURyu, HKim, MSCho, YBhondwe, RSThorat, SASun, WLiu, KLee, JHChoi, SPearce, LVPavlyukovets, VAMorgan, MATran, RLazar, JBlumberg, PMLee, J N-4-t-Butylbenzyl 2-(4-methylsulfonylaminophenyl) propanamide TRPV1 antagonists: Structure-activity relationships in the A-region. Bioorg Med Chem20:215-24 (2011) 
 
Transient receptor potential cation channel subfamily V member 1
Name:Transient receptor potential cation channel subfamily V member 1
Type:Transient Receptor
Mol. Mass.:94956.12
Organism:Rattus norvegicus (rat)
Description:O35433
Residue:838
BDBM20321
NameBDBM20321
Synonyms:3-[(4-tert-butylphenyl)methyl]-1-[(3-fluoro-4-methanesulfonamidophenyl)methyl]thiourea JYL1421 | thiourea analogue, 2
TypeSmall organic molecule
Emp. Form.C20H26FN3O2S2
Mol. Mass.423.568
SMILESCC(C)(C)c1ccc(CNC(=S)NCc2ccc(NS(C)(=O)=O)c(F)c2)cc1