Reaction Details
TargetTransient receptor potential cation channel subfamily V member 1
LigandBDBM50385658
Substrate/Competitorn/a
Meas. Tech.ChEMBL_826070 (CHEMBL2045501)
Ki 7.4±n/a nM
Citation Kim, YSKil, MJKang, SURyu, HKim, MSCho, YBhondwe, RSThorat, SASun, WLiu, KLee, JHChoi, SPearce, LVPavlyukovets, VAMorgan, MATran, RLazar, JBlumberg, PMLee, J N-4-t-Butylbenzyl 2-(4-methylsulfonylaminophenyl) propanamide TRPV1 antagonists: Structure-activity relationships in the A-region. Bioorg Med Chem20:215-24 (2011) 
 
Transient receptor potential cation channel subfamily V member 1
Name:Transient receptor potential cation channel subfamily V member 1
Type:Transient Receptor
Mol. Mass.:94956.12
Organism:Rattus norvegicus (rat)
Description:O35433
Residue:838
BDBM50385658
NameBDBM50385658
Synonyms:CHEMBL2042266
TypeSmall organic molecule
Emp. Form.C21H27BrN2O3S
Mol. Mass.467.42
SMILESCC(C(=O)NCc1ccc(cc1)C(C)(C)C)c1ccc(NS(C)(=O)=O)c(Br)c1