Reaction Details
TargetHeat shock protein HSP 90-beta
LigandBDBM50385994
Substrate/Competitorn/a
Meas. Tech.ChEMBL_825804 (CHEMBL2044533)
IC50 21000±n/a nM
Citation Buchstaller, HPEggenweiler, HMSirrenberg, CGrädler, UMusil, DHoppe, EZimmermann, ASchwartz, HMärz, JBomke, JWegener, AWolf, M Fragment-based discovery of hydroxy-indazole-carboxamides as novel small molecule inhibitors of Hsp90. Bioorg Med Chem Lett22:4396-403 (2012) 
 
Heat shock protein HSP 90-beta
Name:Heat shock protein HSP 90-beta
Type:Molecular Chaperone
Mol. Mass.:83229.45
Organism:Homo sapiens (Human)
Description:P08238
Residue:724
BDBM50385994
NameBDBM50385994
Synonyms:CHEMBL2042888
TypeSmall organic molecule
Emp. Form.C11H9Cl2N3
Mol. Mass.254.115
SMILESNc1nc(Cl)cc(Cc2ccc(Cl)cc2)n1