Reaction Details
TargetHeat shock protein HSP 90-beta
LigandBDBM50385996
Substrate/Competitorn/a
Meas. Tech.ChEMBL_825804 (CHEMBL2044533)
IC50 61000±n/a nM
Citation Buchstaller, HPEggenweiler, HMSirrenberg, CGrädler, UMusil, DHoppe, EZimmermann, ASchwartz, HMärz, JBomke, JWegener, AWolf, M Fragment-based discovery of hydroxy-indazole-carboxamides as novel small molecule inhibitors of Hsp90. Bioorg Med Chem Lett22:4396-403 (2012) 
 
Heat shock protein HSP 90-beta
Name:Heat shock protein HSP 90-beta
Type:Molecular Chaperone
Mol. Mass.:83229.45
Organism:Homo sapiens (Human)
Description:P08238
Residue:724
BDBM50385996
NameBDBM50385996
Synonyms:CHEMBL2042889
TypeSmall organic molecule
Emp. Form.C15H13N3O2
Mol. Mass.267.2826
SMILESNC(=O)c1cc2c(Cc3ccccc3)n[nH]c2cc1O