Reaction Details
TargetHeat shock protein HSP 90-beta
LigandBDBM50385997
Substrate/Competitorn/a
Meas. Tech.ChEMBL_825804 (CHEMBL2044533)
IC50 900±n/a nM
Citation Buchstaller, HPEggenweiler, HMSirrenberg, CGrädler, UMusil, DHoppe, EZimmermann, ASchwartz, HMärz, JBomke, JWegener, AWolf, M Fragment-based discovery of hydroxy-indazole-carboxamides as novel small molecule inhibitors of Hsp90. Bioorg Med Chem Lett22:4396-403 (2012) 
 
Heat shock protein HSP 90-beta
Name:Heat shock protein HSP 90-beta
Type:Molecular Chaperone
Mol. Mass.:83229.45
Organism:Homo sapiens (Human)
Description:P08238
Residue:724
BDBM50385997
NameBDBM50385997
Synonyms:CHEMBL2042887
TypeSmall organic molecule
Emp. Form.C15H12ClN3
Mol. Mass.269.729
SMILESCc1ccc(cc1)-c1nc(N)nc2ccc(Cl)cc12