Reaction Details
TargetHeat shock protein HSP 90-beta
LigandBDBM50385998
Substrate/Competitorn/a
Meas. Tech.ChEMBL_825804 (CHEMBL2044533)
IC50 85000±n/a nM
Citation Buchstaller, HPEggenweiler, HMSirrenberg, CGrädler, UMusil, DHoppe, EZimmermann, ASchwartz, HMärz, JBomke, JWegener, AWolf, M Fragment-based discovery of hydroxy-indazole-carboxamides as novel small molecule inhibitors of Hsp90. Bioorg Med Chem Lett22:4396-403 (2012) 
 
Heat shock protein HSP 90-beta
Name:Heat shock protein HSP 90-beta
Type:Molecular Chaperone
Mol. Mass.:83229.45
Organism:Homo sapiens (Human)
Description:P08238
Residue:724
BDBM50385998
NameBDBM50385998
Synonyms:CHEMBL2042886
TypeSmall organic molecule
Emp. Form.C16H19N3O
Mol. Mass.269.3416
SMILESOc1ccc2c(n[nH]c2c1)C(CC1CCCCC1)C#N