Reaction Details
TargetHeat shock protein HSP 90-beta
LigandBDBM50385999
Substrate/Competitorn/a
Meas. Tech.ChEMBL_825804 (CHEMBL2044533)
IC50 45000±n/a nM
Citation Buchstaller, HPEggenweiler, HMSirrenberg, CGrädler, UMusil, DHoppe, EZimmermann, ASchwartz, HMärz, JBomke, JWegener, AWolf, M Fragment-based discovery of hydroxy-indazole-carboxamides as novel small molecule inhibitors of Hsp90. Bioorg Med Chem Lett22:4396-403 (2012) 
 
Heat shock protein HSP 90-beta
Name:Heat shock protein HSP 90-beta
Type:Molecular Chaperone
Mol. Mass.:83229.45
Organism:Homo sapiens (Human)
Description:P08238
Residue:724
BDBM50385999
NameBDBM50385999
Synonyms:CHEMBL2042885
TypeSmall organic molecule
Emp. Form.C13H10N2O2
Mol. Mass.226.2307
SMILESOc1ccc(cc1)-c1n[nH]c2cc(O)ccc12