Reaction Details
TargetHeat shock protein HSP 90-beta
LigandBDBM50386000
Substrate/Competitorn/a
Meas. Tech.ChEMBL_825804 (CHEMBL2044533)
IC50 87000±n/a nM
Citation Buchstaller, HPEggenweiler, HMSirrenberg, CGrädler, UMusil, DHoppe, EZimmermann, ASchwartz, HMärz, JBomke, JWegener, AWolf, M Fragment-based discovery of hydroxy-indazole-carboxamides as novel small molecule inhibitors of Hsp90. Bioorg Med Chem Lett22:4396-403 (2012) 
 
Heat shock protein HSP 90-beta
Name:Heat shock protein HSP 90-beta
Type:Molecular Chaperone
Mol. Mass.:83229.45
Organism:Homo sapiens (Human)
Description:P08238
Residue:724
BDBM50386000
NameBDBM50386000
Synonyms:CHEMBL2042884
TypeSmall organic molecule
Emp. Form.C12H14N2O
Mol. Mass.202.2524
SMILESOc1ccc2c(n[nH]c2c1)C1CCCC1