Reaction Details
TargetHeat shock protein HSP 90-beta
LigandBDBM50386022
Substrate/Competitorn/a
Meas. Tech.ChEMBL_825804 (CHEMBL2044533)
IC50 760±n/a nM
Citation Buchstaller, HPEggenweiler, HMSirrenberg, CGrädler, UMusil, DHoppe, EZimmermann, ASchwartz, HMärz, JBomke, JWegener, AWolf, M Fragment-based discovery of hydroxy-indazole-carboxamides as novel small molecule inhibitors of Hsp90. Bioorg Med Chem Lett22:4396-403 (2012) 
 
Heat shock protein HSP 90-beta
Name:Heat shock protein HSP 90-beta
Type:Molecular Chaperone
Mol. Mass.:83229.45
Organism:Homo sapiens (Human)
Description:P08238
Residue:724
BDBM50386022
NameBDBM50386022
Synonyms:CHEMBL2042861
TypeSmall organic molecule
Emp. Form.C25H25N3O3
Mol. Mass.415.4843
SMILESCCOc1ccc(CN(C)C(=O)c2cc3c(Cc4ccccc4)n[nH]c3cc2O)cc1