Reaction Details
TargetHeat shock protein HSP 90-beta
LigandBDBM50386026
Substrate/Competitorn/a
Meas. Tech.ChEMBL_825804 (CHEMBL2044533)
IC50 2600±n/a nM
Citation Buchstaller, HPEggenweiler, HMSirrenberg, CGrädler, UMusil, DHoppe, EZimmermann, ASchwartz, HMärz, JBomke, JWegener, AWolf, M Fragment-based discovery of hydroxy-indazole-carboxamides as novel small molecule inhibitors of Hsp90. Bioorg Med Chem Lett22:4396-403 (2012) 
 
Heat shock protein HSP 90-beta
Name:Heat shock protein HSP 90-beta
Type:Molecular Chaperone
Mol. Mass.:83229.45
Organism:Homo sapiens (Human)
Description:P08238
Residue:724
BDBM50386026
NameBDBM50386026
Synonyms:CHEMBL2042865
TypeSmall organic molecule
Emp. Form.C23H20ClN3O2
Mol. Mass.405.877
SMILESCN(Cc1ccccc1)C(=O)c1cc2c(Cc3ccccc3Cl)n[nH]c2cc1O