Reaction Details
TargetHeat shock protein HSP 90-beta
LigandBDBM50386032
Substrate/Competitorn/a
Meas. Tech.ChEMBL_825804 (CHEMBL2044533)
IC50 3000±n/a nM
Citation Buchstaller, HPEggenweiler, HMSirrenberg, CGrädler, UMusil, DHoppe, EZimmermann, ASchwartz, HMärz, JBomke, JWegener, AWolf, M Fragment-based discovery of hydroxy-indazole-carboxamides as novel small molecule inhibitors of Hsp90. Bioorg Med Chem Lett22:4396-403 (2012) 
 
Heat shock protein HSP 90-beta
Name:Heat shock protein HSP 90-beta
Type:Molecular Chaperone
Mol. Mass.:83229.45
Organism:Homo sapiens (Human)
Description:P08238
Residue:724
BDBM50386032
NameBDBM50386032
Synonyms:CHEMBL2042871
TypeSmall organic molecule
Emp. Form.C25H25N3O2
Mol. Mass.399.4849
SMILESCCN(Cc1ccccc1)C(=O)c1cc2c(Cc3cccc(C)c3)n[nH]c2cc1O