Reaction Details
TargetHeat shock protein HSP 90-beta
LigandBDBM50386034
Substrate/Competitorn/a
Meas. Tech.ChEMBL_825804 (CHEMBL2044533)
IC50 1300±n/a nM
Citation Buchstaller, HPEggenweiler, HMSirrenberg, CGrädler, UMusil, DHoppe, EZimmermann, ASchwartz, HMärz, JBomke, JWegener, AWolf, M Fragment-based discovery of hydroxy-indazole-carboxamides as novel small molecule inhibitors of Hsp90. Bioorg Med Chem Lett22:4396-403 (2012) 
 
Heat shock protein HSP 90-beta
Name:Heat shock protein HSP 90-beta
Type:Molecular Chaperone
Mol. Mass.:83229.45
Organism:Homo sapiens (Human)
Description:P08238
Residue:724
BDBM50386034
NameBDBM50386034
Synonyms:CHEMBL2042873
TypeSmall organic molecule
Emp. Form.C25H25N3O2
Mol. Mass.399.4849
SMILESCCc1cccc(Cc2n[nH]c3cc(O)c(cc23)C(=O)N(C)Cc2ccccc2)c1