Reaction Details
TargetHeat shock protein HSP 90-beta
LigandBDBM50386036
Substrate/Competitorn/a
Meas. Tech.ChEMBL_825804 (CHEMBL2044533)
IC50 1300±n/a nM
Citation Buchstaller, HPEggenweiler, HMSirrenberg, CGrädler, UMusil, DHoppe, EZimmermann, ASchwartz, HMärz, JBomke, JWegener, AWolf, M Fragment-based discovery of hydroxy-indazole-carboxamides as novel small molecule inhibitors of Hsp90. Bioorg Med Chem Lett22:4396-403 (2012) 
 
Heat shock protein HSP 90-beta
Name:Heat shock protein HSP 90-beta
Type:Molecular Chaperone
Mol. Mass.:83229.45
Organism:Homo sapiens (Human)
Description:P08238
Residue:724
BDBM50386036
NameBDBM50386036
Synonyms:CHEMBL2042875
TypeSmall organic molecule
Emp. Form.C24H23N3O2
Mol. Mass.385.4583
SMILESCN(Cc1ccccc1)C(=O)c1cc2c(Cc3ccc(C)cc3)n[nH]c2cc1O