Reaction Details
TargetHeat shock protein HSP 90-beta
LigandBDBM50386041
Substrate/Competitorn/a
Meas. Tech.ChEMBL_825804 (CHEMBL2044533)
IC50 730±n/a nM
Citation Buchstaller, HPEggenweiler, HMSirrenberg, CGrädler, UMusil, DHoppe, EZimmermann, ASchwartz, HMärz, JBomke, JWegener, AWolf, M Fragment-based discovery of hydroxy-indazole-carboxamides as novel small molecule inhibitors of Hsp90. Bioorg Med Chem Lett22:4396-403 (2012) 
 
Heat shock protein HSP 90-beta
Name:Heat shock protein HSP 90-beta
Type:Molecular Chaperone
Mol. Mass.:83229.45
Organism:Homo sapiens (Human)
Description:P08238
Residue:724
BDBM50386041
NameBDBM50386041
Synonyms:CHEMBL2042881
TypeSmall organic molecule
Emp. Form.C25H24ClN3O4
Mol. Mass.465.929
SMILESCOc1ccc(CN(C)C(=O)c2cc3c(Cc4cccc(Cl)c4)n[nH]c3cc2O)cc1OC