Reaction Details
TargetHeat shock protein HSP 90-beta
LigandBDBM50386043
Substrate/Competitorn/a
Meas. Tech.ChEMBL_825809 (CHEMBL2044538)
IC50 1000±n/a nM
Citation Buchstaller, HPEggenweiler, HMSirrenberg, CGrädler, UMusil, DHoppe, EZimmermann, ASchwartz, HMärz, JBomke, JWegener, AWolf, M Fragment-based discovery of hydroxy-indazole-carboxamides as novel small molecule inhibitors of Hsp90. Bioorg Med Chem Lett22:4396-403 (2012) 
 
Heat shock protein HSP 90-beta
Name:Heat shock protein HSP 90-beta
Type:Molecular Chaperone
Mol. Mass.:83229.45
Organism:Homo sapiens (Human)
Description:P08238
Residue:724
BDBM50386043
NameBDBM50386043
Synonyms:CHEMBL2042883
TypeSmall organic molecule
Emp. Form.C25H25ClN4O4S
Mol. Mass.513.008
SMILESCN(Cc1ccc(CNS(C)(=O)=O)cc1)C(=O)c1cc2c(Cc3cccc(Cl)c3)n[nH]c2cc1O