Reaction Details
TargetChondroitin sulfate N-acetylgalactosaminyltransferase 1
LigandBDBM50386131
Substrate/Competitorn/a
Meas. Tech.ChEMBL_824644 (CHEMBL2045702)
IC50 60000±n/a nM
Citation Jadhav, RDKadam, KSKandre, SGuha, TReddy, MMBrahma, MKDeshmukh, NJDixit, ADoshi, LPotdar, NEnose, AAVishwakarma, RASivaramakrishnan, HSrinivasan, SNemmani, KVGupte, AGangopadhyay, AKSharma, R Synthesis and biological evaluation of isoxazole, oxazole, and oxadiazole containing heteroaryl analogs of biaryl ureas as DGAT1 inhibitors. Eur J Med Chem54:324-42 (2012) 
 
Chondroitin sulfate N-acetylgalactosaminyltransferase 1
Name:Chondroitin sulfate N-acetylgalactosaminyltransferase 1
Type:PROTEIN
Mol. Mass.:61307.78
Organism:Homo sapiens (Human)
Description:ChEMBL_824644
Residue:532
BDBM50386131
NameBDBM50386131
Synonyms:CHEMBL2042221
TypeSmall organic molecule
Emp. Form.C22H21FN4O5
Mol. Mass.440.4243
SMILESCC(C)[C@H](NC(=O)c1cc(no1)-c1ccc(NC(=O)Nc2ccc(F)cc2)cc1)C(O)=O