Reaction Details
TargetKynurenine--oxoglutarate transaminase 1
LigandBDBM50386292
Substrate/Competitorn/a
Meas. Tech.ChEMBL_826600 (CHEMBL2050768)
IC50 22000±n/a nM
Citation Dounay, ABAnderson, MBechle, BMCampbell, BMClaffey, MMEvdokimov, AEvrard, EFonseca, KRGan, XGhosh, SHayward, MMHorner, WKim, JYMcAllister, LAPandit, JParadis, VParikh, VDReese, MRRong, SSalafia, MASchuyten, KStrick, CATuttle, JBValentine, JWang, HZawadzke, LEVerhoest, PR Discovery of Brain-Penetrant, Irreversible Kynurenine Aminotransferase II Inhibitors for Schizophrenia. ACS Med Chem Lett3:187-192 (2012) 
 
Kynurenine--oxoglutarate transaminase 1
Name:Kynurenine--oxoglutarate transaminase 1
Type:Aminotransferase; Lyase
Mol. Mass.:47874.00
Organism:Homo sapiens (Human)
Description:Recombinant hKAT-1 was expressed and purified from Sf9 insect cells.
Residue:422
BDBM50386292
NameBDBM50386292
Synonyms:CHEMBL2047851
TypeSmall organic molecule
Emp. Form.C9H10N2O2
Mol. Mass.178.1879
SMILESN[C@H]1Cc2ccccc2N(O)C1=O