Reaction Details
TargetKynurenine/alpha-aminoadipate aminotransferase, mitochondrial
LigandBDBM50386313
Substrate/Competitorn/a
Meas. Tech.ChEMBL_826598 (CHEMBL2050766)
IC50>10000±n/a nM
Citation Dounay, ABAnderson, MBechle, BMCampbell, BMClaffey, MMEvdokimov, AEvrard, EFonseca, KRGan, XGhosh, SHayward, MMHorner, WKim, JYMcAllister, LAPandit, JParadis, VParikh, VDReese, MRRong, SSalafia, MASchuyten, KStrick, CATuttle, JBValentine, JWang, HZawadzke, LEVerhoest, PR Discovery of Brain-Penetrant, Irreversible Kynurenine Aminotransferase II Inhibitors for Schizophrenia. ACS Med Chem Lett3:187-192 (2012) 
 
Kynurenine/alpha-aminoadipate aminotransferase, mitochondrial
Name:Kynurenine/alpha-aminoadipate aminotransferase, mitochondrial
Type:Enzyme
Mol. Mass.:47353.09
Organism:Homo sapiens (Human)
Description:Q8N5Z0
Residue:425
BDBM50386313
NameBDBM50386313
Synonyms:CHEMBL2047850
TypeSmall organic molecule
Emp. Form.C9H10N2O
Mol. Mass.162.1885
SMILESN[C@H]1Cc2ccccc2NC1=O