Reaction Details
TargetKynurenine/alpha-aminoadipate aminotransferase, mitochondrial
LigandBDBM50386302
Substrate/Competitorn/a
Meas. Tech.ChEMBL_826598 (CHEMBL2050766)
IC50 3280±n/a nM
Citation Dounay, ABAnderson, MBechle, BMCampbell, BMClaffey, MMEvdokimov, AEvrard, EFonseca, KRGan, XGhosh, SHayward, MMHorner, WKim, JYMcAllister, LAPandit, JParadis, VParikh, VDReese, MRRong, SSalafia, MASchuyten, KStrick, CATuttle, JBValentine, JWang, HZawadzke, LEVerhoest, PR Discovery of Brain-Penetrant, Irreversible Kynurenine Aminotransferase II Inhibitors for Schizophrenia. ACS Med Chem Lett3:187-192 (2012) 
 
Kynurenine/alpha-aminoadipate aminotransferase, mitochondrial
Name:Kynurenine/alpha-aminoadipate aminotransferase, mitochondrial
Type:Enzyme
Mol. Mass.:47353.09
Organism:Homo sapiens (Human)
Description:Q8N5Z0
Residue:425
BDBM50386302
NameBDBM50386302
Synonyms:CHEMBL2047855
TypeSmall organic molecule
Emp. Form.C10H12N2O2
Mol. Mass.192.2145
SMILESC[C@@H]1[C@H](N)C(=O)N(O)c2ccccc12