Reaction Details
TargetBeta-secretase 1
LigandBDBM50386513
Substrate/Competitorn/a
Meas. Tech.ChEMBL_826122 (CHEMBL2049563)
IC50 126±n/a nM
Citation Rueeger, HLueoend, RRogel, ORondeau, JMMöbitz, HMachauer, RJacobson, LStaufenbiel, MDesrayaud, SNeumann, U Discovery of cyclic sulfone hydroxyethylamines as potent and selectiveß-site APP-cleaving enzyme 1 (BACE1) inhibitors: structure-based design and in vivo reduction of amyloidß-peptides. J Med Chem55:3364-86 (2012) 
 
Beta-secretase 1
Name:Beta-secretase 1
Type:Protein
Mol. Mass.:55755.10
Organism:Homo sapiens (Human)
Description:P56817
Residue:501
BDBM50386513
NameBDBM50386513
Synonyms:CHEMBL2048051
TypeSmall organic molecule
Emp. Form.C28H38F4N2O5S
Mol. Mass.590.67
SMILESCCOC[C@@H](Oc1cc(C[C@@H]2CS(=O)(=O)C[C@H](NCc3cccc(c3)C(C)(C)C)[C@H]2O)cc(F)c1N)C(F)(F)F