Reaction Details
TargetCytochrome P450 2C9
LigandBDBM50388466
Substrate/Competitorn/a
Meas. Tech.ChEMBL_829952 (CHEMBL2061657)
IC50 3981.07±n/a nM
Citation Ren, FDeng, GWang, HLuan, LMeng, QXu, QXu, HXu, XZhang, HZhao, BLi, CGuo, TBYang, JZhang, WZhao, YJia, QLu, HXiang, JNElliott, JDLin, X Discovery of novel 1,2,4-thiadiazole derivatives as potent, orally active agonists of sphingosine 1-phosphate receptor subtype 1 (S1P(1)). J Med Chem55:4286-96 (2012) 
 
Cytochrome P450 2C9
Name:Cytochrome P450 2C9
Type:Enzyme
Mol. Mass.:55636.33
Organism:Homo sapiens (Human)
Description:P11712
Residue:490
BDBM50388466
NameBDBM50388466
Synonyms:CHEMBL2059520
TypeSmall organic molecule
Emp. Form.C25H26N2O3S
Mol. Mass.434.551
SMILESCCc1c(CCCC(O)=O)cccc1-c1cnc(s1)-c1ccc(OC(C)C)c(c1)C#N