Reaction Details
TargetCytochrome P450 2C9
LigandBDBM50388473
Substrate/Competitorn/a
Meas. Tech.ChEMBL_829952 (CHEMBL2061657)
IC50 7943.28±n/a nM
Citation Ren, FDeng, GWang, HLuan, LMeng, QXu, QXu, HXu, XZhang, HZhao, BLi, CGuo, TBYang, JZhang, WZhao, YJia, QLu, HXiang, JNElliott, JDLin, X Discovery of novel 1,2,4-thiadiazole derivatives as potent, orally active agonists of sphingosine 1-phosphate receptor subtype 1 (S1P(1)). J Med Chem55:4286-96 (2012) 
 
Cytochrome P450 2C9
Name:Cytochrome P450 2C9
Type:Enzyme
Mol. Mass.:55636.33
Organism:Homo sapiens (Human)
Description:P11712
Residue:490
BDBM50388473
NameBDBM50388473
Synonyms:CHEMBL2059519
TypeSmall organic molecule
Emp. Form.C24H25N3O4
Mol. Mass.419.473
SMILESCCc1c(CCCC(O)=O)cccc1-c1nnc(o1)-c1ccc(OC(C)C)c(c1)C#N