Reaction Details
TargetSphingosine 1-phosphate receptor 3
LigandBDBM50388464
Substrate/Competitorn/a
Meas. Tech.ChEMBL_829948 (CHEMBL2061653)
EC50>3162.28±n/a nM
Citation Ren, FDeng, GWang, HLuan, LMeng, QXu, QXu, HXu, XZhang, HZhao, BLi, CGuo, TBYang, JZhang, WZhao, YJia, QLu, HXiang, JNElliott, JDLin, X Discovery of novel 1,2,4-thiadiazole derivatives as potent, orally active agonists of sphingosine 1-phosphate receptor subtype 1 (S1P(1)). J Med Chem55:4286-96 (2012) 
 
Sphingosine 1-phosphate receptor 3
Name:Sphingosine 1-phosphate receptor 3
Type:G Protein-Coupled Receptor (GPCR)
Mol. Mass.:42278.13
Organism:Homo sapiens (Human)
Description:Q99500
Residue:378
BDBM50388464
NameBDBM50388464
Synonyms:CHEMBL2057285
TypeSmall organic molecule
Emp. Form.C29H34N4O2S
Mol. Mass.502.671
SMILESCCc1c(CCN2CCC(CC2)C(O)=O)cccc1-c1nsc(n1)-c1ccc(CC(C)C)c(c1)C#N