Reaction Details
TargetSphingosine 1-phosphate receptor 3
LigandBDBM50388470
Substrate/Competitorn/a
Meas. Tech.ChEMBL_829948 (CHEMBL2061653)
EC50>10000±n/a nM
Citation Ren, FDeng, GWang, HLuan, LMeng, QXu, QXu, HXu, XZhang, HZhao, BLi, CGuo, TBYang, JZhang, WZhao, YJia, QLu, HXiang, JNElliott, JDLin, X Discovery of novel 1,2,4-thiadiazole derivatives as potent, orally active agonists of sphingosine 1-phosphate receptor subtype 1 (S1P(1)). J Med Chem55:4286-96 (2012) 
 
Sphingosine 1-phosphate receptor 3
Name:Sphingosine 1-phosphate receptor 3
Type:G Protein-Coupled Receptor (GPCR)
Mol. Mass.:42278.13
Organism:Homo sapiens (Human)
Description:Q99500
Residue:378
BDBM50388470
NameBDBM50388470
Synonyms:CHEMBL2057232
TypeSmall organic molecule
Emp. Form.C26H27N3O3
Mol. Mass.429.5109
SMILESCCc1c(CCCC(O)=O)cccc1-c1cnc(nc1)-c1ccc(OC(C)C)c(c1)C#N