Reaction Details
TargetSphingosine 1-phosphate receptor 3
LigandBDBM50420110
Substrate/Competitorn/a
Meas. Tech.ChEMBL_829948 (CHEMBL2061653)
EC50>3162.28±n/a nM
Citation Ren, FDeng, GWang, HLuan, LMeng, QXu, QXu, HXu, XZhang, HZhao, BLi, CGuo, TBYang, JZhang, WZhao, YJia, QLu, HXiang, JNElliott, JDLin, X Discovery of novel 1,2,4-thiadiazole derivatives as potent, orally active agonists of sphingosine 1-phosphate receptor subtype 1 (S1P(1)). J Med Chem55:4286-96 (2012) 
 
Sphingosine 1-phosphate receptor 3
Name:Sphingosine 1-phosphate receptor 3
Type:G Protein-Coupled Receptor (GPCR)
Mol. Mass.:42278.13
Organism:Homo sapiens (Human)
Description:Q99500
Residue:378
BDBM50420110
NameBDBM50420110
Synonyms:CHEMBL2059683
TypeSmall organic molecule
Emp. Form.C24H26F3N3O3S
Mol. Mass.493.542
SMILESCCc1c(CCNCC(O)=O)cccc1-c1nsc(n1)-c1ccc(OC(C)C)c(c1)C(F)(F)F