Reaction Details
TargetSphingosine 1-phosphate receptor 1
LigandBDBM50420143
Substrate/Competitorn/a
Meas. Tech.ChEMBL_829947 (CHEMBL2061652)
EC50 25.12±n/a nM
Citation Ren, FDeng, GWang, HLuan, LMeng, QXu, QXu, HXu, XZhang, HZhao, BLi, CGuo, TBYang, JZhang, WZhao, YJia, QLu, HXiang, JNElliott, JDLin, X Discovery of novel 1,2,4-thiadiazole derivatives as potent, orally active agonists of sphingosine 1-phosphate receptor subtype 1 (S1P(1)). J Med Chem55:4286-96 (2012) 
 
Sphingosine 1-phosphate receptor 1
Name:Sphingosine 1-phosphate receptor 1
Type:Enzyme
Mol. Mass.:42836.02
Organism:Homo sapiens (Human)
Description:P21453
Residue:382
BDBM50420143
NameBDBM50420143
Synonyms:CHEMBL2059677
TypeSmall organic molecule
Emp. Form.C23H24F3N3O3S
Mol. Mass.479.515
SMILESCCc1c(CCCC(O)=O)cncc1-c1nsc(n1)-c1ccc(OC(C)C)c(c1)C(F)(F)F