Reaction Details
TargetAcetyl-CoA carboxylase 2
LigandBDBM50388656
Substrate/Competitorn/a
Meas. Tech.ChEMBL_829263 (CHEMBL2060085)
IC50 5.9±n/a nM
Citation Kamata, MYamashita, TKina, ATawada, MEndo, SMizukami, ASasaki, MTani, ANakano, YWatanabe, YFuruyama, NFunami, MAmano, NFukatsu, K Symmetrical approach of spiro-pyrazolidinediones as acetyl-CoA carboxylase inhibitors. Bioorg Med Chem Lett22:4769-72 (2012) 
 
Acetyl-CoA carboxylase 2
Name:Acetyl-CoA carboxylase 2
Type:Protein
Mol. Mass.:276535.21
Organism:Homo sapiens (Human)
Description:O00763
Residue:2458
BDBM50388656
NameBDBM50388656
Synonyms:CHEMBL2059301
TypeSmall organic molecule
Emp. Form.C27H34N6O5S
Mol. Mass.554.661
SMILESCOc1cccc2c(C(=O)N3CCC(CC3)N3CCCC4(C3)C(=O)N3CCCCN3C4=O)c(NC(N)=O)sc12