Reaction Details
TargetAcetyl-CoA carboxylase 2
LigandBDBM50388662
Substrate/Competitorn/a
Meas. Tech.ChEMBL_829263 (CHEMBL2060085)
IC50 33±n/a nM
Citation Kamata, MYamashita, TKina, ATawada, MEndo, SMizukami, ASasaki, MTani, ANakano, YWatanabe, YFuruyama, NFunami, MAmano, NFukatsu, K Symmetrical approach of spiro-pyrazolidinediones as acetyl-CoA carboxylase inhibitors. Bioorg Med Chem Lett22:4769-72 (2012) 
 
Acetyl-CoA carboxylase 2
Name:Acetyl-CoA carboxylase 2
Type:Protein
Mol. Mass.:276535.21
Organism:Homo sapiens (Human)
Description:O00763
Residue:2458
BDBM50388662
NameBDBM50388662
Synonyms:CHEMBL2059094
TypeSmall organic molecule
Emp. Form.C27H34N6O4S
Mol. Mass.538.662
SMILESCCNC(=O)Nc1sc2ccccc2c1C(=O)N1CCC(CC1)N1CCCC2(C1)C(=O)N1CCCN1C2=O