Reaction Details
TargetAcetyl-CoA carboxylase 2
LigandBDBM50388664
Substrate/Competitorn/a
Meas. Tech.ChEMBL_829263 (CHEMBL2060085)
IC50 20±n/a nM
Citation Kamata, MYamashita, TKina, ATawada, MEndo, SMizukami, ASasaki, MTani, ANakano, YWatanabe, YFuruyama, NFunami, MAmano, NFukatsu, K Symmetrical approach of spiro-pyrazolidinediones as acetyl-CoA carboxylase inhibitors. Bioorg Med Chem Lett22:4769-72 (2012) 
 
Acetyl-CoA carboxylase 2
Name:Acetyl-CoA carboxylase 2
Type:Protein
Mol. Mass.:276535.21
Organism:Homo sapiens (Human)
Description:O00763
Residue:2458
BDBM50388664
NameBDBM50388664
Synonyms:CHEMBL2059092
TypeSmall organic molecule
Emp. Form.C26H34N6O4S
Mol. Mass.526.651
SMILESCCNC(=O)Nc1sc2ccccc2c1C(=O)N1CCC(CC1)N1CCCC2(C1)C(=O)N(C)N(C)C2=O