Reaction Details
TargetAcetyl-CoA carboxylase 1
LigandBDBM50388663
Substrate/Competitorn/a
Meas. Tech.ChEMBL_829262 (CHEMBL2060084)
IC50 41±n/a nM
Citation Kamata, MYamashita, TKina, ATawada, MEndo, SMizukami, ASasaki, MTani, ANakano, YWatanabe, YFuruyama, NFunami, MAmano, NFukatsu, K Symmetrical approach of spiro-pyrazolidinediones as acetyl-CoA carboxylase inhibitors. Bioorg Med Chem Lett22:4769-72 (2012) 
 
Acetyl-CoA carboxylase 1
Name:Acetyl-CoA carboxylase 1
Type:Protein
Mol. Mass.:265543.22
Organism:Homo sapiens (Human)
Description:Q13085
Residue:2346
BDBM50388663
NameBDBM50388663
Synonyms:CHEMBL2059093
TypeSmall organic molecule
Emp. Form.C27H36N6O4S
Mol. Mass.540.678
SMILESCCN1N(CC)C(=O)C2(CCCN(C2)C2CCN(CC2)C(=O)c2c(NC(=O)NC)sc3ccccc23)C1=O