Reaction Details
TargetAcetyl-CoA carboxylase 1
LigandBDBM50388655
Substrate/Competitorn/a
Meas. Tech.ChEMBL_829266 (CHEMBL2060088)
IC50 28±n/a nM
Citation Kamata, MYamashita, TKina, ATawada, MEndo, SMizukami, ASasaki, MTani, ANakano, YWatanabe, YFuruyama, NFunami, MAmano, NFukatsu, K Symmetrical approach of spiro-pyrazolidinediones as acetyl-CoA carboxylase inhibitors. Bioorg Med Chem Lett22:4769-72 (2012) 
 
Acetyl-CoA carboxylase 1
Name:Acetyl-CoA carboxylase 1
Type:Protein
Mol. Mass.:265183.92
Organism:Rattus norvegicus (Rat)
Description:P11497
Residue:2345
BDBM50388655
NameBDBM50388655
Synonyms:CHEMBL2059303
TypeSmall organic molecule
Emp. Form.C29H38N6O5S
Mol. Mass.582.714
SMILESCCNC(=O)Nc1sc2c(OC)cccc2c1C(=O)N1CCC(CC1)N1CCCC2(C1)C(=O)N1CCCCN1C2=O