Reaction Details
TargetSmoothened homolog
LigandBDBM50388709
Substrate/Competitorn/a
Meas. Tech.ChEMBL_829474 (CHEMBL2061994)
IC50 7±n/a nM
Citation Yang, BHird, AWRussell, DJFauber, BPDakin, LAZheng, XSu, QGodin, RBrassil, PDevereaux, EJanetka, JW Discovery of novel hedgehog antagonists from cell-based screening: Isosteric modification of p38 bisamides as potent inhibitors of SMO. Bioorg Med Chem Lett22:4907-11 (2012) 
 
Smoothened homolog
Name:Smoothened homolog
Type:Protein
Mol. Mass.:86415.51
Organism:Homo sapiens (Human)
Description:Q99835
Residue:787
BDBM50388709
NameBDBM50388709
Synonyms:CHEMBL2059867
TypeSmall organic molecule
Emp. Form.C24H22N4O2
Mol. Mass.398.4571
SMILESCc1nc(c[nH]1)-c1ccc(C)c(NC(=O)c2ccc(OCc3ccccn3)cc2)c1