Reaction Details
TargetVascular endothelial growth factor receptor 2
LigandBDBM50389220
Substrate/Competitorn/a
Meas. Tech.ChEMBL_831541 (CHEMBL2066305)
IC50>1000±n/a nM
Citation Hsu, JTYeh, TKYen, SCChen, CTHsieh, SYHsu, TLu, CTChen, CHChou, LHChiu, CHChang, YITseng, YJYen, KRChao, YSLin, WHJiaang, WT 3-Phenyl-1H-5-pyrazolylamine-based derivatives as potent and efficacious inhibitors of FMS-like tyrosine kinase-3 (FLT3). Bioorg Med Chem Lett22:4654-9 (2012) 
 
Vascular endothelial growth factor receptor 2
Name:Vascular endothelial growth factor receptor 2
Type:Receptor Tyrosine Kinase
Mol. Mass.:151510.97
Organism:Homo sapiens (Human)
Description:P35968
Residue:1356
BDBM50389220
NameBDBM50389220
Synonyms:CHEMBL2063334
TypeSmall organic molecule
Emp. Form.C28H30N6O3S
Mol. Mass.530.641
SMILESCN1CCN(CC1)c1ccc(cc1)C(=O)Nc1cc(n[nH]1)-c1ccc(CNS(=O)(=O)c2ccccc2)cc1