Reaction Details
TargetVascular endothelial growth factor receptor 2
LigandBDBM50389227
Substrate/Competitorn/a
Meas. Tech.ChEMBL_831541 (CHEMBL2066305)
IC50 190±n/a nM
Citation Hsu, JTYeh, TKYen, SCChen, CTHsieh, SYHsu, TLu, CTChen, CHChou, LHChiu, CHChang, YITseng, YJYen, KRChao, YSLin, WHJiaang, WT 3-Phenyl-1H-5-pyrazolylamine-based derivatives as potent and efficacious inhibitors of FMS-like tyrosine kinase-3 (FLT3). Bioorg Med Chem Lett22:4654-9 (2012) 
 
Vascular endothelial growth factor receptor 2
Name:Vascular endothelial growth factor receptor 2
Type:Receptor Tyrosine Kinase
Mol. Mass.:151510.97
Organism:Homo sapiens (Human)
Description:P35968
Residue:1356
BDBM50389227
NameBDBM50389227
Synonyms:CHEMBL2063436
TypeSmall organic molecule
Emp. Form.C27H30N8O2
Mol. Mass.498.5795
SMILESCc1nc(Nc2cc(n[nH]2)-c2ccc(CNC(=O)OCc3ccccc3)cc2)cc(n1)N1CCNCC1