Reaction Details
TargetAurora kinase A
LigandBDBM50389233
Substrate/Competitorn/a
Meas. Tech.ChEMBL_831542 (CHEMBL2066306)
IC50 880±n/a nM
Citation Hsu, JTYeh, TKYen, SCChen, CTHsieh, SYHsu, TLu, CTChen, CHChou, LHChiu, CHChang, YITseng, YJYen, KRChao, YSLin, WHJiaang, WT 3-Phenyl-1H-5-pyrazolylamine-based derivatives as potent and efficacious inhibitors of FMS-like tyrosine kinase-3 (FLT3). Bioorg Med Chem Lett22:4654-9 (2012) 
 
Aurora kinase A
Name:Aurora kinase A
Type:Serine/threonine-protein kinase
Mol. Mass.:45830.98
Organism:Homo sapiens (Human)
Description:O14965
Residue:403
BDBM50389233
NameBDBM50389233
Synonyms:CHEMBL2063323
TypeSmall organic molecule
Emp. Form.C30H32N6O3
Mol. Mass.524.6135
SMILESCN1CCN(CC1)c1ccc(cc1)C(=O)Nc1cc(n[nH]1)-c1ccc(CNC(=O)OCc2ccccc2)cc1