Reaction Details
TargetAurora kinase A
LigandBDBM50389226
Substrate/Competitorn/a
Meas. Tech.ChEMBL_831542 (CHEMBL2066306)
IC50>1000±n/a nM
Citation Hsu, JTYeh, TKYen, SCChen, CTHsieh, SYHsu, TLu, CTChen, CHChou, LHChiu, CHChang, YITseng, YJYen, KRChao, YSLin, WHJiaang, WT 3-Phenyl-1H-5-pyrazolylamine-based derivatives as potent and efficacious inhibitors of FMS-like tyrosine kinase-3 (FLT3). Bioorg Med Chem Lett22:4654-9 (2012) 
 
Aurora kinase A
Name:Aurora kinase A
Type:Serine/threonine-protein kinase
Mol. Mass.:45830.98
Organism:Homo sapiens (Human)
Description:O14965
Residue:403
BDBM50389226
NameBDBM50389226
Synonyms:CHEMBL2063435
TypeSmall organic molecule
Emp. Form.C27H33N9O4
Mol. Mass.547.6088
SMILESCc1cc(COC(=O)NCc2ccc(cc2)-c2cc(Nc3cc(nc(C)n3)N3CCN(CCO)CC3)[nH]n2)no1