Reaction Details
TargetAurora kinase A
LigandBDBM50389227
Substrate/Competitorn/a
Meas. Tech.ChEMBL_831542 (CHEMBL2066306)
IC50 350±n/a nM
Citation Hsu, JTYeh, TKYen, SCChen, CTHsieh, SYHsu, TLu, CTChen, CHChou, LHChiu, CHChang, YITseng, YJYen, KRChao, YSLin, WHJiaang, WT 3-Phenyl-1H-5-pyrazolylamine-based derivatives as potent and efficacious inhibitors of FMS-like tyrosine kinase-3 (FLT3). Bioorg Med Chem Lett22:4654-9 (2012) 
 
Aurora kinase A
Name:Aurora kinase A
Type:Serine/threonine-protein kinase
Mol. Mass.:45830.98
Organism:Homo sapiens (Human)
Description:O14965
Residue:403
BDBM50389227
NameBDBM50389227
Synonyms:CHEMBL2063436
TypeSmall organic molecule
Emp. Form.C27H30N8O2
Mol. Mass.498.5795
SMILESCc1nc(Nc2cc(n[nH]2)-c2ccc(CNC(=O)OCc3ccccc3)cc2)cc(n1)N1CCNCC1