Reaction Details
TargetVascular endothelial growth factor receptor 1
LigandBDBM50389222
Substrate/Competitorn/a
Meas. Tech.ChEMBL_831540 (CHEMBL2066304)
IC50>1000±n/a nM
Citation Hsu, JTYeh, TKYen, SCChen, CTHsieh, SYHsu, TLu, CTChen, CHChou, LHChiu, CHChang, YITseng, YJYen, KRChao, YSLin, WHJiaang, WT 3-Phenyl-1H-5-pyrazolylamine-based derivatives as potent and efficacious inhibitors of FMS-like tyrosine kinase-3 (FLT3). Bioorg Med Chem Lett22:4654-9 (2012) 
 
Vascular endothelial growth factor receptor 1
Name:Vascular endothelial growth factor receptor 1
Type:Receptor Tyrosine Kinase
Mol. Mass.:150800.23
Organism:Homo sapiens (Human)
Description:P17948
Residue:1338
BDBM50389222
NameBDBM50389222
Synonyms:CHEMBL2063336
TypeSmall organic molecule
Emp. Form.C27H31N9O2
Mol. Mass.513.5941
SMILESCN1CCN(CC1)c1cc(Nc2cc(n[nH]2)-c2ccc(CNC(=O)OCc3cccnc3)cc2)nc(C)n1