Reaction Details
TargetVascular endothelial growth factor receptor 1
LigandBDBM50300690
Substrate/Competitorn/a
Meas. Tech.ChEMBL_831540 (CHEMBL2066304)
IC50>10000±n/a nM
Citation Hsu, JTYeh, TKYen, SCChen, CTHsieh, SYHsu, TLu, CTChen, CHChou, LHChiu, CHChang, YITseng, YJYen, KRChao, YSLin, WHJiaang, WT 3-Phenyl-1H-5-pyrazolylamine-based derivatives as potent and efficacious inhibitors of FMS-like tyrosine kinase-3 (FLT3). Bioorg Med Chem Lett22:4654-9 (2012) 
 
Vascular endothelial growth factor receptor 1
Name:Vascular endothelial growth factor receptor 1
Type:Receptor Tyrosine Kinase
Mol. Mass.:150800.23
Organism:Homo sapiens (Human)
Description:P17948
Residue:1338
BDBM50300690
NameBDBM50300690
Synonyms:1-(5-Tert-Butyl-1,2-Oxazol-3-Yl)-3-(4-{7-[2-(Morpholin-4-Yl)ethoxy]imidazo[2,1-B][1,3]benzothiazol-2-Yl}phenyl)urea AC 220 AC010220 ASP-2689 N-(5-tert-Butyl-isoxazol-3-yl)-N'-{4-[7-(2-morpholin-4-yl-ethoxy)imidazo[2,1-b][1,3]benzothiazol-2-yl]phenyl}urea Quizartinib (AC220) US11542261, Compound quizartinib | US9216997, Quizartinib (positive compound)
TypeSmall organic molecule
Emp. Form.C29H32N6O4S
Mol. Mass.560.667
SMILESCC(C)(C)c1cc(NC(=O)Nc2ccc(cc2)-c2cn3c(n2)sc2cc(OCCN4CCOCC4)ccc32)no1