Reaction Details
TargetDipeptidyl peptidase 8
LigandBDBM50389475
Substrate/Competitorn/a
Meas. Tech.ChEMBL_832306 (CHEMBL2066844)
IC50 27±n/a nM
Citation Wu, WLiu, YMilo, LJShu, YZhao, PLi, YWoznica, IYu, GSanford, DGZhou, YPoplawski, SEConnolly, BASudmeier, JLBachovchin, WWLai, JH 4-Substituted boro-proline dipeptides: synthesis, characterization, and dipeptidyl peptidase IV, 8, and 9 activities. Bioorg Med Chem Lett22:5536-40 (2012) 
 
Dipeptidyl peptidase 8
Name:Dipeptidyl peptidase 8
Type:Enzyme
Mol. Mass.:103342.62
Organism:Homo sapiens (Human)
Description:Q6V1X1
Residue:898
BDBM50389475
NameBDBM50389475
Synonyms:CHEMBL2063035
TypeSmall organic molecule
Emp. Form.C9H17BN2O5
Mol. Mass.244.053
SMILESOB(O)[C@@H]1C[C@H](O)CN1C(=O)[C@@H]1C[C@@H](O)CN1