Reaction Details
TargetDipeptidyl peptidase 8
LigandBDBM11162
Substrate/Competitorn/a
Meas. Tech.ChEMBL_832306 (CHEMBL2066844)
IC50 11000±n/a nM
Citation Wu, WLiu, YMilo, LJShu, YZhao, PLi, YWoznica, IYu, GSanford, DGZhou, YPoplawski, SEConnolly, BASudmeier, JLBachovchin, WWLai, JH 4-Substituted boro-proline dipeptides: synthesis, characterization, and dipeptidyl peptidase IV, 8, and 9 activities. Bioorg Med Chem Lett22:5536-40 (2012) 
 
Dipeptidyl peptidase 8
Name:Dipeptidyl peptidase 8
Type:Enzyme
Mol. Mass.:103342.62
Organism:Homo sapiens (Human)
Description:Q6V1X1
Residue:898
BDBM11162
NameBDBM11162
Synonyms:(1R)-3-oxo-3-[3-(trifluoroethyl)-5,6-dihydro[1,2,4]triazolo[4,3-a]pyrazin-7(8H)-yl]-1-(2,4,5-trifluorobenzyl)propylamine CHEMBL393336 Sitagliptin Triazolopiperazine Analogue 1 | US10479798, Compound MK0431
TypeSmall organic molecule
Emp. Form.C16H15F6N5O
Mol. Mass.407.3136
SMILESN[C@@H](CC(=O)N1CCn2c(C1)nnc2C(F)(F)F)Cc1cc(F)c(F)cc1F