Reaction Details
TargetDipeptidyl peptidase 9
LigandBDBM50389466
Substrate/Competitorn/a
Meas. Tech.ChEMBL_832307 (CHEMBL2066845)
IC50 125±n/a nM
Citation Wu, WLiu, YMilo, LJShu, YZhao, PLi, YWoznica, IYu, GSanford, DGZhou, YPoplawski, SEConnolly, BASudmeier, JLBachovchin, WWLai, JH 4-Substituted boro-proline dipeptides: synthesis, characterization, and dipeptidyl peptidase IV, 8, and 9 activities. Bioorg Med Chem Lett22:5536-40 (2012) 
 
Dipeptidyl peptidase 9
Name:Dipeptidyl peptidase 9
Type:Enzyme
Mol. Mass.:98260.70
Organism:Homo sapiens (Human)
Description:Q86TI2
Residue:863
BDBM50389466
NameBDBM50389466
Synonyms:CHEMBL2063025
TypeSmall organic molecule
Emp. Form.C7H15BN2O4
Mol. Mass.202.016
SMILESC[C@H](N)C(=O)N1C[C@H](O)C[C@H]1B(O)O