Reaction Details
TargetDipeptidyl peptidase 9
LigandBDBM50389474
Substrate/Competitorn/a
Meas. Tech.ChEMBL_832307 (CHEMBL2066845)
IC50 98±n/a nM
Citation Wu, WLiu, YMilo, LJShu, YZhao, PLi, YWoznica, IYu, GSanford, DGZhou, YPoplawski, SEConnolly, BASudmeier, JLBachovchin, WWLai, JH 4-Substituted boro-proline dipeptides: synthesis, characterization, and dipeptidyl peptidase IV, 8, and 9 activities. Bioorg Med Chem Lett22:5536-40 (2012) 
 
Dipeptidyl peptidase 9
Name:Dipeptidyl peptidase 9
Type:Enzyme
Mol. Mass.:98260.70
Organism:Homo sapiens (Human)
Description:Q86TI2
Residue:863
BDBM50389474
NameBDBM50389474
Synonyms:CHEMBL2063034
TypeSmall organic molecule
Emp. Form.C9H17BN2O4
Mol. Mass.228.053
SMILESOB(O)[C@@H]1C[C@@H](O)CN1C(=O)[C@@H]1CCCN1